{"text_format":"1","workbook":"xlsx","n_sheets":16,"sheets":["Główna","Szkolenia","Umowy stale","Umowy zywienie","Dane1","Dane2","Media","ŻYWIENIE","SZKOLENIE NAUCZYCIELI","POZOSTAŁE ZAKUPY I USŁUGI","SŁOWNIE szkolenia","SŁOWNIE MEDIA","SŁOWNIE ŻYWIENIE","SŁOWNIE POZOSTAŁE","Opisy pozostałe","Listy"],"not_rendered":{"charts":0,"images":12,"macros":1,"external_links":1,"defined_names":22,"comments":0,"pivot_tables":0},"unopened":[],"bounds":{"document_bytes":16777216,"sheet_cells":100000,"rows_first":2000,"rows_last":500,"rows_between":2000,"halvings":0,"cell_chars":16384,"cell_head_chars":4096},"cells_cut":0,"cells_raw":0,"read":"part_too_large","date_system":"1900"}

{"sheet":"Główna","index":0,"n_rows":25,"n_cols":11,"rows_kept":25,"cut":false,"hidden":false,"merged":[[24,10,24,15],[9,10,9,15]]}
[]
[]
[]
[]
[]
[]
{"$rows_left_out":20}
{"sheet":"Szkolenia","index":1,"n_rows":35,"n_cols":8,"rows_kept":35,"cut":false,"hidden":false,"merged":[[6,8,6,9],[24,3,24,11],[22,3,22,11],[9,3,9,11],[23,3,23,11],[6,2,6,6],[8,2,8,6],[11,3,11,11],[21,3,21,11],[10,3,10,11],[13,3,13,11],[14,3,14,11],[15,3,15,11],[16,3,16,11],[17,3,17,11],[18,3,18,11],[32,3,32,11],[33,3,33,11],[34,3,34,11],[12,3,12,11],[27,3,27,11],[28,3,28,11],[29,3,29,11],[30,3,30,11],[31,3,31,11],[20,3,20,11],[26,3,26,11],[25,3,25,11],[19,3,19,11]]}
[]
[]
[]
[]
[]
[null,null,"SZKOLENIA NAUCZYCIELSKIE - UCHWAŁA MIASTA"]
{"$rows_left_out":30}
{"sheet":"Umowy stale","index":2,"n_rows":30,"n_cols":15,"rows_kept":30,"cut":false,"hidden":false,"merged":[[27,10,27,14],[28,10,28,14],[29,10,29,14],[21,10,21,14],[22,10,22,14],[23,10,23,14],[24,10,24,14],[25,10,25,14],[26,10,26,14]]}
["Kontrahent - wybór","Paragraf 1","Paragraf 2","Zamówienia publiczne","Nr umowy","nr opisu 1","nr opisu 2","rodzaj opodatkowania",null,"OPIS 1","nazwa",null,"OPIS 2","I człon","II człon"]
["EN. ELEKTRYCZNA - dystrybucja",4260,null,null,null,null,null,null,null,1,"Faktura dotyczy rozliczenia za miesiąc",null,1,"Usługa wykonana zgodnie z umową ( nr ",") i wskazaniem licznika"]
["EN. ELEKTRYCZNA - sprzedaż",4260,null,null,null,null,null,null,null,2,"Faktura dotyczy abonamentu za m-c",null,2,"Usługa wykonana zgodnie z umową nr "]
["EN. CIEPLNA - rozliczenie",4260,null,null,null,null,null,null,null,3,"Faktura za dostęp do sieci INTERNET"]
["EN. CIEPLNA - zaliczka",4260,null,null,null,null,null,null,null,4,{"$f":"\"Faktura za abonament telefoniczny\"&CHAR(10)&\" oraz dostęp do sieci INTERNET w miesiącu\"","v":"Faktura za abonament telefoniczny\n oraz dostęp do sieci INTERNET w miesiącu"}]
["WODA / ŚCIEKI - zaliczka",4260,4300,null,null,null,null,null,null,5,"Faktura dotyczy zaliczki za m-c"]
{"$rows_left_out":25}
{"sheet":"Umowy zywienie","index":3,"n_rows":0,"n_cols":0,"rows_kept":0,"cut":false,"hidden":false,"merged":[],"read":"part_too_large"}

{"sheet":"Dane1","index":4,"n_rows":47,"n_cols":17,"rows_kept":47,"cut":false,"hidden":false,"merged":[[1,10,2,10],[24,2,24,3],[8,2,8,3],[9,2,9,3],[2,2,2,3],[3,2,3,3],[4,2,4,3],[5,2,5,3],[6,2,6,3],[7,2,7,3]]}
[]
[null,null,null,null,null,null,null,null,null,null,"ZADANIE BUDŻETOWE"]
[null,null,"OPIS ŻYWIENIE",null,null,"ŚRODKI",null,null,"ROZDZIAŁ",null,null,null,"PARAGRAF",null,"ZAMÓWIENIA PUBLICZNE",null,"LATA"]
[null,null,"Zakupione artykuły wpisano do kartoteki magazynu żywieniowego.",null,null,"BUDŻET",null,null,80101,null,"B.V.1.1.1",null,3020,null,"z zastosowaniem procedur zgodnie z regulaminem udzielania zamówień publicznych o wartości niższej niż 130 000 zł netto w związku z art. 2 ust. 1 pkt 1 ustawy Pzp",null,2023]
[null,null,"Zakupiono artykuły z nadwyżki żywieniowej.",null,null,"WRD",null,null,80103,null,"B.V.1.12.1",null,3260,null,"z zastosowaniem procedur zgodnie z ustawą Prawo zamówień publicznych z dnia 11.09.2019 r. na podstawie art. 275 pkt 1",null,2024]
[null,null,"Zakup posiłków w ramach stypendium - \"Posiłek dla ucznia\"",null,null,"ZFŚS",null,null,80104,null,"B.V.1.19",null,4190,null,"z zastosowaniem procedur zgodnie z ustawą Prawo zamówień publicznych z dnia 11.09.2019 r. na podstawie art. 132",null,2025]
{"$rows_left_out":42}
{"sheet":"Dane2","index":5,"n_rows":20,"n_cols":4,"rows_kept":20,"cut":false,"hidden":false,"merged":[[19,5,19,6],[7,5,7,10],[9,5,9,10],[13,5,13,6],[15,5,15,10]]}
[]
[]
[]
[]
[]
[]
{"$rows_left_out":15}
{"sheet":"Media","index":6,"n_rows":54,"n_cols":26,"rows_kept":54,"cut":false,"hidden":false,"merged":[[14,1,14,13],[11,5,11,13],[11,1,11,4],[30,16,30,28],[43,7,43,8],[39,7,39,8],[19,1,19,3],[38,1,38,3],[19,4,19,13],[15,1,15,6],[41,1,42,4],[30,1,31,13],[8,7,10,13],[17,1,17,7],[7,1,7,6],[50,23,50,28],[46,7,46,8],[47,7,47,8],[48,7,48,12],[50,1,50,13],[49,23,49,24],[46,17,46,29],[47,17,47,29],[45,7,45,10],[21,4,21,13],[42,5,42,6],[41,7,41,10],[38,5,38,6],[52,7,52,8],[35,7,35,12],[34,7,34,8],[44,7,44,12],[40,7,40,12],[1,8,1,13],[0,1,0,6],[53,7,53,12],[13,1,13,4],[13,5,13,8],[6,1,6,6],[8,1,8,6],[7,8,7,9],[20,4,20,13],[15,12,15,13],[9,1,9,6],[7,12,7,13],[18,11,18,13],[10,1,10,6],[32,1,32,13],[5,8,6,13]]}
[null,"Kontrahent - wybór",null,null,null,null,null,null,null,null,null,null,null,null,null,null,null,null,null,null,null,false]
[null,null,null,null,null,null,null,null,{"$f":"IF(V2=\"Kontrahent - wybór\",\" \",VLOOKUP(V2,kontrahenci,1,0))","v":" "},null,null,null,null,null,null,null,null,null,null,null,null,{"$f":"B1","v":"Kontrahent - wybór"}]
[]
[]
[null,null,null,null,null,null,null,null,null,null,null,null,null,null,null,null,null,null,null,null,null,"opis1","opis2","NR UMOWY","próg kwotowy","rodzaj opodatkowania"]
[null,null,null,null,null,null,null,null,{"$f":"IF(V6=\"\",\"\",VLOOKUP(V6,'Umowy stale'!J2:K13,2,0))","v":""},null,null,null,null,null,null,null,null,null,null,null,null,{"$f":"IF(V2=\"Kontrahent - wybór\",\"\",VLOOKUP(V2,'Umowy stale'!A2:G30,6,FALSE))","v":""},{"$f":"IF(V2=\"Kontrahent - wybór\",\"\",VLOOKUP(V2,'Umowy stale'!A2:G30,7,FALSE))","v":""},{"$f":"IF(V2=\"Kontrahent - wybór\",\"\",IF(VLOOKUP(V2,'Umowy stale'!A2:G30,5,FALSE)=\"\",\"……………….\",VLOOKUP(V2,'Umowy stale'!A2:G30,5,FALSE)))","v":""},{"$f":"IF(V2=\"Kontrahent - wybór\",\"\",VLOOKUP(V2,'Umowy stale'!A2:H30,4,FALSE))","v":""},{"$f":"IF(V2=\"Kontrahent - wybór\",\"\",VLOOKUP(V2,'Umowy stale'!A2:H30,8,FALSE))","v":""}]
{"$rows_left_out":49}
{"sheet":"ŻYWIENIE","index":7,"n_rows":48,"n_cols":22,"rows_kept":48,"cut":false,"hidden":false,"merged":[[0,1,0,6],[1,8,2,14],[11,1,11,6],[11,7,11,8],[11,12,11,13],[9,1,9,4],[2,1,2,6],[5,8,6,14],[3,8,4,14],[9,9,9,13],[6,1,6,6],[10,1,10,13],[7,5,7,13],[7,1,7,4],[3,1,3,6],[9,5,9,8],[47,7,47,12],[14,11,14,13],[39,7,39,10],[28,7,28,8],[35,1,36,4],[35,7,35,10],[29,7,29,12],[36,5,36,6],[32,1,32,3],[46,7,46,8],[34,7,34,12],[15,1,15,3],[16,4,16,13],[17,4,17,13],[13,1,13,7],[4,1,4,6],[5,1,5,6],[15,4,15,13],[44,1,44,13],[40,7,40,8],[38,7,38,12],[37,7,37,8],[24,1,25,13],[26,1,26,13],[42,7,42,12],[32,5,32,6],[41,7,41,8],[33,7,33,8]]}
[null,"Kontrahent - wybór"]
[]
[null,{"$f":"Media!B7","v":" "}]
[null,{"$f":"Media!B8","v":0}]
[null,{"$f":"CONCATENATE(Dane2!F12,\" \",Dane2!F14,\", ul. \",Dane2!F16,\" \",Dane2!F18)","v":" , ul.  "}]
[null,{"$f":"IF(Dane2!F20=\"\",\"\",Dane2!F20)","v":""},null,null,null,null,null,null,{"$f":"IF(V6<>\"\",CONCATENATE(\"Zakup zrealizowano na podstawie umowy nr \",VLOOKUP(V6,'Umowy zywienie'!A2:B30,2,FALSE),\".\"),\"\")","v":""},null,null,null,null,null,null,null,null,null,null,null,null,{"$f":"IF(OR(B1=\"Kontrahent - wybór\",B1=\"\"),\"\",B1)","v":""}]
{"$rows_left_out":43}
{"sheet":"SZKOLENIE NAUCZYCIELI","index":8,"n_rows":58,"n_cols":24,"rows_kept":58,"cut":false,"hidden":false,"merged":[[0,1,0,6],[1,1,1,6],[3,8,3,14],[4,8,4,14],[5,8,6,13],[3,1,3,6],[4,1,4,6],[5,14,6,14],[56,10,56,12],[56,3,56,5],[5,1,5,6],[20,4,20,13],[52,11,52,12],[14,1,14,6],[14,7,14,8],[14,12,14,13],[19,4,19,13],[43,7,43,8],[16,1,16,7],[49,7,49,8],[13,1,13,14],[10,5,10,14],[10,1,10,4],[6,1,6,6],[7,1,7,6],[7,8,8,14],[12,1,12,4],[12,5,12,8],[9,5,9,11],[9,12,9,14],[51,14,51,17],[52,14,52,17],[53,3,53,12],[39,5,39,6],[40,7,40,8],[50,7,50,12],[44,7,44,8],[45,7,45,12],[47,1,47,13],[17,11,17,13],[18,1,18,3],[18,4,18,13],[57,10,57,12],[56,1,56,2],[57,1,57,3],[41,7,41,12],[42,7,42,10],[56,6,56,8],[52,0,52,10],[38,1,39,4],[32,7,32,12],[38,7,38,10],[35,5,35,6],[57,6,57,8],[54,4,54,8],[35,1,35,3],[36,7,36,8],[37,7,37,12],[31,7,31,8],[27,1,28,13],[29,1,29,13]]}
[null,"wybierz adresata szkolenia",null,null,null,null,null,null,null,null,null,null,null,null,null,null,null,null,null,null,null,true]
[null,"INDYWIDUALNIE"]
[]
[null,{"$f":"Media!B7","v":" "},null,null,null,null,null,null,{"$f":"IF(B2=X6,X8,X9)","v":"Potwierdzam udział w szkoleniu Pani(a):"}]
[null,{"$f":"Media!B8","v":0},null,null,null,null,null,null,null,null,null,null,null,null,null,null,null,null,null,null,null,null,null,"RADA PEDAGOGICZNA"]
[null,{"$f":"CONCATENATE(Dane2!F12,\" \",Dane2!F14,\", ul. \",Dane2!F16,\" \",Dane2!F18)","v":" , ul.  "},null,null,null,null,null,null,"Zakres szkolenia dotyczy priorytetu zawartego w § 3 pkt",null,null,null,null,null,null,null,null,null,null,null,null,null,null,"INDYWIDUALNIE"]
{"$rows_left_out":53}
{"sheet":"POZOSTAŁE ZAKUPY I USŁUGI","index":9,"n_rows":56,"n_cols":22,"rows_kept":56,"cut":false,"hidden":false,"merged":[[56,14,56,17],[10,9,10,14],[17,4,17,13],[52,4,52,5],[15,11,15,13],[36,7,36,10],[18,4,18,13],[49,14,49,17],[50,14,50,17],[29,7,29,8],[11,1,11,14],[43,7,43,12],[33,1,33,3],[33,5,33,6],[34,7,34,8],[35,7,35,12],[1,1,1,6],[2,1,2,6],[3,1,3,6],[5,1,5,6],[10,5,10,8],[7,5,8,14],[1,8,3,14],[6,1,6,6],[5,7,5,11],[7,1,8,4],[39,7,39,12],[36,1,37,4],[37,5,37,6],[38,7,38,8],[40,7,40,10],[55,1,55,3],[55,6,55,8],[55,10,55,12],[51,3,51,12],[54,1,54,2],[54,3,54,5],[54,10,54,12],[54,6,54,8],[50,11,50,12],[41,7,41,8],[45,1,45,13],[12,1,12,6],[12,7,12,8],[12,12,12,13],[14,1,14,7],[16,4,16,13],[16,1,16,3],[30,7,30,12],[25,1,26,13],[27,1,27,13],[48,7,48,12],[47,7,47,8],[42,7,42,8],[50,0,50,10]]}
[null,null,null,null,null,null,null,null,null,null,null,null,null,null,null,null,null,null,null,null,null,true]
[null,{"$f":"Media!B7","v":" "}]
[null,{"$f":"Media!B8","v":0}]
[null,{"$f":"CONCATENATE(Dane2!F12,\" \",Dane2!F14,\", ul. \",Dane2!F16,\" \",Dane2!F18)","v":" , ul.  "}]
[]
[null,{"$f":"IF(Dane2!F20=\"\",\"\",Dane2!F20)","v":""}]
{"$rows_left_out":51}
{"sheet":"SŁOWNIE szkolenia","index":10,"n_rows":15,"n_cols":10,"rows_kept":15,"cut":false,"hidden":false,"merged":[[0,6,0,7]]}
[{"$f":"ABS(A15)","v":0},null,null,null,null,null,"jeżeli \"naście\""]
[null,null,"0-5","6-9","0-5","6-9","0-5","6-9","dodatek","sumuj te ciągi"]
[{"$f":"INT(A$1/10000000)","v":0},null,{"$f":"IF(AND(A3>=0,A3<=5),1,0)","v":1},{"$f":"IF(AND(A3>=6,A3<=9),1,0)","v":0},{"$f":"IF(A3=0,\"\",IF(A3=1,IF(A4=0,\"dziesięć milionów \",\"\"),IF(A3=2,\"dwadzieścia \",IF(A3=3,\"trzydzieści \",IF(A3=4,\"czterdzieści \",IF(A3=5,\"pięćdziesiąt \",\"\"))))))","v":""},{"$f":"IF(A3=6,\"sześćdziesiąt \",IF(A3=7,\"siedemdziesiąt \",IF(A3=8,\"osiemdziesiąt \",IF(A3=9,\"dziewięćdziesiąt \",\"\"))))","v":""},null,null,null,{"$f":"IF(C3,E3&I3,IF(D3,F3&I3,\"\"))","v":""}]
[{"$f":"INT(A$1/1000000)-A3*10","v":0},null,{"$f":"IF(AND(A4>=0,A4<=5),1,0)","v":1},{"$f":"IF(AND(A4>=6,A4<=9),1,0)","v":0},{"$f":"IF(A4=0,IF(AND(A3<>0,A3<>1),\"milionów \",\"\"),IF(A4=1,IF(A3=0,\"jeden milion \",\"jeden milionów \"),IF(A4=2,\"dwa miliony \",IF(A4=3,\"trzy miliony \",IF(A4=4,\"cztery miliony \",IF(A4=5,\"pięć milionów \",\"\"))))))","v":""},{"$f":"IF(A4=6,\"sześć milionów \",IF(A4=7,\"siedem milionów \",IF(A4=8,\"osiem milionów \",IF(A4=9,\"dziewięć milionów \",\"\"))))","v":""},{"$f":"IF(A4=0,\"\",IF(A4=1,\"jedenaście milionów \",IF(A4=2,\"dwanaście milionów \",IF(A4=3,\"trzynaście milionów \",IF(A4=4,\"czternaście milionów \",IF(A4=5,\"piętnaście milionów \",\"\"))))))","v":""},{"$f":"IF(A4=6,\"szesnaście milionów \",IF(A4=7,\"siedemnaście milionów \",IF(A4=8,\"osiemnaście milionów \",IF(A4=9,\"dziewiętnaście milionów \",\"\"))))","v":""},null,{"$f":"IF(A3=1,IF(C4,G4,IF(D4,H4)),IF(C4,E4,IF(D4,F4,\"\")))","v":""}]
[{"$f":"INT(A$1/100000)-10*A4-100*A3","v":0},null,1,0,{"$f":"IF(A5=0,\"\",IF(A5=1,\"sto \",IF(A5=2,\"dwieście \",IF(A5=3,\"trzysta \",IF(A5=4,\"czterysta \",IF(A5=5,\"pięćset \",\"\"))))))","v":""},{"$f":"IF(A5=6,\"sześćset \",IF(A5=7,\"siedemset \",IF(A5=8,\"osiemset \",IF(A5=9,\"dziewięćset \",\"\"))))","v":""},null,null,null,{"$f":"IF(C5,E5&I5,IF(D5,F5&I5,\"\"))","v":""}]
[{"$f":"INT(A$1/10000)-10*A5-100*A4-1000*A3","v":0},null,1,0,{"$f":"IF(A6=0,\"\",IF(A6=1,IF(A7=0,\"dziesięć tysięcy \",\"\"),IF(A6=2,\"dwadzieścia \",IF(A6=3,\"trzydzieści \",IF(A6=4,\"czterdzieści \",IF(A6=5,\"pięćdziesiąt \",\"\"))))))","v":""},{"$f":"IF(A6=6,\"sześćdziesiąt \",IF(A6=7,\"siedemdziesiąt \",IF(A6=8,\"osiemdziesiąt \",IF(A6=9,\"dziewięćdziesiąt \",\"\"))))","v":""},null,null,null,{"$f":"IF(C6,E6&I6,IF(D6,F6&I6,\"\"))","v":""}]
{"$rows_left_out":10}
{"sheet":"SŁOWNIE MEDIA","index":11,"n_rows":15,"n_cols":10,"rows_kept":15,"cut":false,"hidden":false,"merged":[[0,6,0,7]]}
[{"$f":"ABS(A15)","v":0},null,null,null,null,null,"jeżeli \"naście\""]
[null,null,"0-5","6-9","0-5","6-9","0-5","6-9","dodatek","sumuj te ciągi"]
[{"$f":"INT(A$1/10000000)","v":0},null,{"$f":"IF(AND(A3>=0,A3<=5),1,0)","v":1},{"$f":"IF(AND(A3>=6,A3<=9),1,0)","v":0},{"$f":"IF(A3=0,\"\",IF(A3=1,IF(A4=0,\"dziesięć milionów \",\"\"),IF(A3=2,\"dwadzieścia \",IF(A3=3,\"trzydzieści \",IF(A3=4,\"czterdzieści \",IF(A3=5,\"pięćdziesiąt \",\"\"))))))","v":""},{"$f":"IF(A3=6,\"sześćdziesiąt \",IF(A3=7,\"siedemdziesiąt \",IF(A3=8,\"osiemdziesiąt \",IF(A3=9,\"dziewięćdziesiąt \",\"\"))))","v":""},null,null,null,{"$f":"IF(C3,E3&I3,IF(D3,F3&I3,\"\"))","v":""}]
[{"$f":"INT(A$1/1000000)-A3*10","v":0},null,{"$f":"IF(AND(A4>=0,A4<=5),1,0)","v":1},{"$f":"IF(AND(A4>=6,A4<=9),1,0)","v":0},{"$f":"IF(A4=0,IF(AND(A3<>0,A3<>1),\"milionów \",\"\"),IF(A4=1,IF(A3=0,\"jeden milion \",\"jeden milionów \"),IF(A4=2,\"dwa miliony \",IF(A4=3,\"trzy miliony \",IF(A4=4,\"cztery miliony \",IF(A4=5,\"pięć milionów \",\"\"))))))","v":""},{"$f":"IF(A4=6,\"sześć milionów \",IF(A4=7,\"siedem milionów \",IF(A4=8,\"osiem milionów \",IF(A4=9,\"dziewięć milionów \",\"\"))))","v":""},{"$f":"IF(A4=0,\"\",IF(A4=1,\"jedenaście milionów \",IF(A4=2,\"dwanaście milionów \",IF(A4=3,\"trzynaście milionów \",IF(A4=4,\"czternaście milionów \",IF(A4=5,\"piętnaście milionów \",\"\"))))))","v":""},{"$f":"IF(A4=6,\"szesnaście milionów \",IF(A4=7,\"siedemnaście milionów \",IF(A4=8,\"osiemnaście milionów \",IF(A4=9,\"dziewiętnaście milionów \",\"\"))))","v":""},null,{"$f":"IF(A3=1,IF(C4,G4,IF(D4,H4)),IF(C4,E4,IF(D4,F4,\"\")))","v":""}]
[{"$f":"INT(A$1/100000)-10*A4-100*A3","v":0},null,1,0,{"$f":"IF(A5=0,\"\",IF(A5=1,\"sto \",IF(A5=2,\"dwieście \",IF(A5=3,\"trzysta \",IF(A5=4,\"czterysta \",IF(A5=5,\"pięćset \",\"\"))))))","v":""},{"$f":"IF(A5=6,\"sześćset \",IF(A5=7,\"siedemset \",IF(A5=8,\"osiemset \",IF(A5=9,\"dziewięćset \",\"\"))))","v":""},null,null,null,{"$f":"IF(C5,E5&I5,IF(D5,F5&I5,\"\"))","v":""}]
[{"$f":"INT(A$1/10000)-10*A5-100*A4-1000*A3","v":0},null,1,0,{"$f":"IF(A6=0,\"\",IF(A6=1,IF(A7=0,\"dziesięć tysięcy \",\"\"),IF(A6=2,\"dwadzieścia \",IF(A6=3,\"trzydzieści \",IF(A6=4,\"czterdzieści \",IF(A6=5,\"pięćdziesiąt \",\"\"))))))","v":""},{"$f":"IF(A6=6,\"sześćdziesiąt \",IF(A6=7,\"siedemdziesiąt \",IF(A6=8,\"osiemdziesiąt \",IF(A6=9,\"dziewięćdziesiąt \",\"\"))))","v":""},null,null,null,{"$f":"IF(C6,E6&I6,IF(D6,F6&I6,\"\"))","v":""}]
{"$rows_left_out":10}
{"sheet":"SŁOWNIE ŻYWIENIE","index":12,"n_rows":15,"n_cols":10,"rows_kept":15,"cut":false,"hidden":false,"merged":[[0,6,0,7]]}
[{"$f":"ABS(A15)","v":0},null,null,null,null,null,"jeżeli \"naście\""]
[null,null,"0-5","6-9","0-5","6-9","0-5","6-9","dodatek","sumuj te ciągi"]
[{"$f":"INT(A$1/10000000)","v":0},null,{"$f":"IF(AND(A3>=0,A3<=5),1,0)","v":1},{"$f":"IF(AND(A3>=6,A3<=9),1,0)","v":0},{"$f":"IF(A3=0,\"\",IF(A3=1,IF(A4=0,\"dziesięć milionów \",\"\"),IF(A3=2,\"dwadzieścia \",IF(A3=3,\"trzydzieści \",IF(A3=4,\"czterdzieści \",IF(A3=5,\"pięćdziesiąt \",\"\"))))))","v":""},{"$f":"IF(A3=6,\"sześćdziesiąt \",IF(A3=7,\"siedemdziesiąt \",IF(A3=8,\"osiemdziesiąt \",IF(A3=9,\"dziewięćdziesiąt \",\"\"))))","v":""},null,null,null,{"$f":"IF(C3,E3&I3,IF(D3,F3&I3,\"\"))","v":""}]
[{"$f":"INT(A$1/1000000)-A3*10","v":0},null,{"$f":"IF(AND(A4>=0,A4<=5),1,0)","v":1},{"$f":"IF(AND(A4>=6,A4<=9),1,0)","v":0},{"$f":"IF(A4=0,IF(AND(A3<>0,A3<>1),\"milionów \",\"\"),IF(A4=1,IF(A3=0,\"jeden milion \",\"jeden milionów \"),IF(A4=2,\"dwa miliony \",IF(A4=3,\"trzy miliony \",IF(A4=4,\"cztery miliony \",IF(A4=5,\"pięć milionów \",\"\"))))))","v":""},{"$f":"IF(A4=6,\"sześć milionów \",IF(A4=7,\"siedem milionów \",IF(A4=8,\"osiem milionów \",IF(A4=9,\"dziewięć milionów \",\"\"))))","v":""},{"$f":"IF(A4=0,\"\",IF(A4=1,\"jedenaście milionów \",IF(A4=2,\"dwanaście milionów \",IF(A4=3,\"trzynaście milionów \",IF(A4=4,\"czternaście milionów \",IF(A4=5,\"piętnaście milionów \",\"\"))))))","v":""},{"$f":"IF(A4=6,\"szesnaście milionów \",IF(A4=7,\"siedemnaście milionów \",IF(A4=8,\"osiemnaście milionów \",IF(A4=9,\"dziewiętnaście milionów \",\"\"))))","v":""},null,{"$f":"IF(A3=1,IF(C4,G4,IF(D4,H4)),IF(C4,E4,IF(D4,F4,\"\")))","v":""}]
[{"$f":"INT(A$1/100000)-10*A4-100*A3","v":0},null,1,0,{"$f":"IF(A5=0,\"\",IF(A5=1,\"sto \",IF(A5=2,\"dwieście \",IF(A5=3,\"trzysta \",IF(A5=4,\"czterysta \",IF(A5=5,\"pięćset \",\"\"))))))","v":""},{"$f":"IF(A5=6,\"sześćset \",IF(A5=7,\"siedemset \",IF(A5=8,\"osiemset \",IF(A5=9,\"dziewięćset \",\"\"))))","v":""},null,null,null,{"$f":"IF(C5,E5&I5,IF(D5,F5&I5,\"\"))","v":""}]
[{"$f":"INT(A$1/10000)-10*A5-100*A4-1000*A3","v":0},null,1,0,{"$f":"IF(A6=0,\"\",IF(A6=1,IF(A7=0,\"dziesięć tysięcy \",\"\"),IF(A6=2,\"dwadzieścia \",IF(A6=3,\"trzydzieści \",IF(A6=4,\"czterdzieści \",IF(A6=5,\"pięćdziesiąt \",\"\"))))))","v":""},{"$f":"IF(A6=6,\"sześćdziesiąt \",IF(A6=7,\"siedemdziesiąt \",IF(A6=8,\"osiemdziesiąt \",IF(A6=9,\"dziewięćdziesiąt \",\"\"))))","v":""},null,null,null,{"$f":"IF(C6,E6&I6,IF(D6,F6&I6,\"\"))","v":""}]
{"$rows_left_out":10}
{"sheet":"SŁOWNIE POZOSTAŁE","index":13,"n_rows":31,"n_cols":10,"rows_kept":31,"cut":false,"hidden":false,"merged":[[0,6,0,7],[16,6,16,7]]}
[{"$f":"ABS(A15)","v":0},null,null,null,null,null,"jeżeli \"naście\""]
[null,null,"0-5","6-9","0-5","6-9","0-5","6-9","dodatek","sumuj te ciągi"]
[{"$f":"INT(A$1/10000000)","v":0},null,{"$f":"IF(AND(A3>=0,A3<=5),1,0)","v":1},{"$f":"IF(AND(A3>=6,A3<=9),1,0)","v":0},{"$f":"IF(A3=0,\"\",IF(A3=1,IF(A4=0,\"dziesięć milionów \",\"\"),IF(A3=2,\"dwadzieścia \",IF(A3=3,\"trzydzieści \",IF(A3=4,\"czterdzieści \",IF(A3=5,\"pięćdziesiąt \",\"\"))))))","v":""},{"$f":"IF(A3=6,\"sześćdziesiąt \",IF(A3=7,\"siedemdziesiąt \",IF(A3=8,\"osiemdziesiąt \",IF(A3=9,\"dziewięćdziesiąt \",\"\"))))","v":""},null,null,null,{"$f":"IF(C3,E3&I3,IF(D3,F3&I3,\"\"))","v":""}]
[{"$f":"INT(A$1/1000000)-A3*10","v":0},null,{"$f":"IF(AND(A4>=0,A4<=5),1,0)","v":1},{"$f":"IF(AND(A4>=6,A4<=9),1,0)","v":0},{"$f":"IF(A4=0,IF(AND(A3<>0,A3<>1),\"milionów \",\"\"),IF(A4=1,IF(A3=0,\"jeden milion \",\"jeden milionów \"),IF(A4=2,\"dwa miliony \",IF(A4=3,\"trzy miliony \",IF(A4=4,\"cztery miliony \",IF(A4=5,\"pięć milionów \",\"\"))))))","v":""},{"$f":"IF(A4=6,\"sześć milionów \",IF(A4=7,\"siedem milionów \",IF(A4=8,\"osiem milionów \",IF(A4=9,\"dziewięć milionów \",\"\"))))","v":""},{"$f":"IF(A4=0,\"\",IF(A4=1,\"jedenaście milionów \",IF(A4=2,\"dwanaście milionów \",IF(A4=3,\"trzynaście milionów \",IF(A4=4,\"czternaście milionów \",IF(A4=5,\"piętnaście milionów \",\"\"))))))","v":""},{"$f":"IF(A4=6,\"szesnaście milionów \",IF(A4=7,\"siedemnaście milionów \",IF(A4=8,\"osiemnaście milionów \",IF(A4=9,\"dziewiętnaście milionów \",\"\"))))","v":""},null,{"$f":"IF(A3=1,IF(C4,G4,IF(D4,H4)),IF(C4,E4,IF(D4,F4,\"\")))","v":""}]
[{"$f":"INT(A$1/100000)-10*A4-100*A3","v":0},null,1,0,{"$f":"IF(A5=0,\"\",IF(A5=1,\"sto \",IF(A5=2,\"dwieście \",IF(A5=3,\"trzysta \",IF(A5=4,\"czterysta \",IF(A5=5,\"pięćset \",\"\"))))))","v":""},{"$f":"IF(A5=6,\"sześćset \",IF(A5=7,\"siedemset \",IF(A5=8,\"osiemset \",IF(A5=9,\"dziewięćset \",\"\"))))","v":""},null,null,null,{"$f":"IF(C5,E5&I5,IF(D5,F5&I5,\"\"))","v":""}]
[{"$f":"INT(A$1/10000)-10*A5-100*A4-1000*A3","v":0},null,1,0,{"$f":"IF(A6=0,\"\",IF(A6=1,IF(A7=0,\"dziesięć tysięcy \",\"\"),IF(A6=2,\"dwadzieścia \",IF(A6=3,\"trzydzieści \",IF(A6=4,\"czterdzieści \",IF(A6=5,\"pięćdziesiąt \",\"\"))))))","v":""},{"$f":"IF(A6=6,\"sześćdziesiąt \",IF(A6=7,\"siedemdziesiąt \",IF(A6=8,\"osiemdziesiąt \",IF(A6=9,\"dziewięćdziesiąt \",\"\"))))","v":""},null,null,null,{"$f":"IF(C6,E6&I6,IF(D6,F6&I6,\"\"))","v":""}]
{"$rows_left_out":26}
{"sheet":"Opisy pozostałe","index":14,"n_rows":32,"n_cols":8,"rows_kept":32,"cut":false,"hidden":false,"merged":[]}
[]
[]
[]
[]
[]
[]
{"$rows_left_out":27}
{"sheet":"Listy","index":15,"n_rows":15,"n_cols":5,"rows_kept":15,"cut":false,"hidden":false,"merged":[]}
[null,"Wydatek dotyczy:"]
[null,"wyłącznie działalności opodatkowanej",null,null,"MIESIĄCE"]
[null,"jednocześnie działalności opodatkowanej i zwolnionej."]
[null,"jednocześnie działalności opodatkowanej i niepodlegającej opodatkowaniu (statutowej)",null,null,"styczeń"]
[null,"jednocześnie działalności opodatkowanej, zwolnionej i niepodlegajacej opodatkowaniu (statutowej)",null,null,"luty"]
[null,"wyłącznie działalności statutowej lub/i zwolnionej (brak możliwości odliczenia).",null,null,"marzec"]
{"$rows_left_out":9}