{"text_format":"1","workbook":"xlsx","n_sheets":7,"sheets":["INSTRUKCJA","DANE PLACÓWKI","LISTA UCZNIÓW","PIECZĄTKA STYPENDIA","Arkusz1","PIECZĄTKA WYPRAWKA","PRZYKŁADOWE OPISY"],"not_rendered":{"charts":0,"images":2,"macros":1,"external_links":3,"defined_names":27,"comments":0,"pivot_tables":0},"unopened":[],"bounds":{"document_bytes":16777216,"sheet_cells":100000,"rows_first":2000,"rows_last":500,"rows_between":2000,"halvings":0,"cell_chars":16384,"cell_head_chars":4096},"cells_cut":0,"cells_raw":0,"read":"whole","date_system":"1900"}

{"sheet":"INSTRUKCJA","index":0,"n_rows":85,"n_cols":6,"rows_kept":85,"cut":false,"hidden":false,"merged":[[83,1,83,9],[84,1,84,9],[68,1,68,9],[69,1,69,9],[73,1,73,9],[77,1,77,9],[81,1,81,9],[67,1,67,9],[23,1,23,9],[8,1,8,9],[9,1,9,9],[15,1,15,9],[18,1,18,9],[27,1,27,9],[30,1,30,9],[50,1,50,9],[53,1,53,9],[59,1,59,9],[63,1,63,9],[42,1,42,9],[7,1,7,9],[5,1,6,9],[10,1,10,9],[35,1,35,9],[38,1,38,9]]}
[]
[]
[null,null,null,null,null,"INSTRUKCJA OPISYWANIA FAKTUR W PROGRAMIE EXCEL "]
[null,null,null,null,null,"W RAMACH STYPENDIUM SOCJALNEGO / WYPRAWKI SZKOLNEJ"]
[]
[null,"Rozpoczynając pracę po raz pierwszy z elektronicznym drukiem opisu faktury dotyczącej stypendium należy pamiętać o:"]
[]
[null,"- na żółtym pasku powyżej należy kliknąć przycisk \"Włącz zawartość\";"]
[null,"- w pierwszej kolejności należy wypełnić arkusz \"DANE PLACÓWKI\" o dane placówki;"]
[null,"- w drugiej kolejności wypełnić arkusz „LISTA UCZNIÓW” o listę uczniów;"]
[null,"- do wpisania lub wyboru danych w arkuszu „PIECZĄTKA\" służą tylko pola w kolorze żółtym;"]
[null,"- ustawienia pliku zostały tak zaktualizowane, aby wydruk nie zawierał kolorowego"]
[null,"tła (wydruk czarno-biały)."]
[]
[null,"Arkusz PIECZĄTKA STYPENDIA – służy do przygotowania opisu faktury."]
[null,"Uwaga! Jeżeli po raz pierwszy wypełniają Państwo dokument, należy w pierwszej kolejności "]
[null,"wypełnić arkusz „DANE PLACÓWKI” oraz „LISTA UCZNIÓW”. Instrukcja do tych "]
[null,"arkuszy znajduje się poniżej. "]
[null,"Krok po kroku – wypełnianie arkusza PIECZĄTKA:"]
[null,"1. Wyboru rodzaju opisu dokonujemy poprzez rozwinięcie listy znajdującej się w komórkach "]
{"$rows_left_out":66}
{"sheet":"DANE PLACÓWKI","index":1,"n_rows":32,"n_cols":22,"rows_kept":32,"cut":false,"hidden":false,"merged":[[7,5,7,10],[9,5,9,10],[13,5,13,6],[19,5,19,6],[15,6,15,10]]}
[]
[]
[]
[]
[]
[null,null,null,null,null,null,null,null,null,null,null,null,null,null,null,"DZIAŁ",null,"ROZDZIAŁ",null,"ZADANIE",null,"PARAGRAF"]
[null,null,null,null,null,null,null,null,null,null,null,null,null,null,null,801,null,80101,null,"B/V/1/1/1",null,3020]
[null,null,null,"Nazwa placówki",null,null,null,null,null,null,null,null,null,null,null,854,null,80103,null,"B/V/1/10/1",null,3050]
[null,null,null,null,null,null,null,null,null,null,null,null,null,null,null,null,null,80104,null,"B/V/1/12/1",null,3240]
[null,null,null,"imię lub II człon  nazwy",null,null,null,null,null,null,null,null,null,null,null,null,null,80105,null,"B/V/1/19/1",null,3260]
[null,null,null,null,null,null,null,null,null,null,null,null,null,null,null,null,null,80110,null,"B/V/1/2/1",null,4130]
[null,null,null,"Kod pocztowy",null,null,null,null,null,null,null,null,null,null,null,null,null,80120,null,"B/V/1/20/1",null,4170]
[null,null,null,null,null,null,null,null,null,null,null,null,null,null,null,null,null,80123,null,"B/V/1/21",null,4210]
[null,null,null,"Miejscowość",null,null,null,null,null,null,null,null,null,null,null,null,null,80130,null,"B/V/1/22",null,4220]
[null,null,null,null,null,null,null,null,null,null,null,null,null,null,null,null,null,80146,null,"B/V/1/27",null,4240]
[null,null,null,"Ulica",null,"ul. ",null,null,null,null,null,null,null,null,null,null,null,80148,null,"B/V/1/28",null,4260]
[null,null,null,null,null,null,null,null,null,null,null,null,null,null,null,null,null,80195,null,"B/V/1/3/1",null,4270]
[null,null,null,"nr",null,null,null,null,null,null,null,null,null,null,null,null,null,85401,null,"B/V/1/30",null,4280]
[null,null,null,null,null,null,null,null,null,null,null,null,null,null,null,null,null,85406,null,"B/V/1/4/1",null,4300]
[null,null,null,"telefon",null,null,null,null,null,null,null,null,null,null,null,null,null,85407,null,"B/V/1/6/1",null,4410]
{"$rows_left_out":13}
{"sheet":"LISTA UCZNIÓW","index":2,"n_rows":1,"n_cols":3,"rows_kept":1,"cut":false,"hidden":false,"merged":[]}
[null,"NUMER DECYZJI","IMIĘ I NAZWISKO UCZNIA"]

{"sheet":"PIECZĄTKA STYPENDIA","index":3,"n_rows":57,"n_cols":17,"rows_kept":57,"cut":false,"hidden":false,"merged":[[56,10,56,14],[47,10,47,15],[21,4,21,16],[22,4,22,7],[22,8,22,10],[55,10,55,11],[29,4,29,15],[53,4,53,15],[37,4,37,6],[46,10,46,15],[48,4,49,11],[38,12,38,14],[51,10,51,14],[50,10,50,14],[44,10,44,11],[40,4,41,11],[11,1,11,3],[12,4,12,19],[14,4,14,19],[11,4,11,19],[13,4,13,19],[12,1,12,3],[5,4,5,10],[6,4,6,10],[7,4,7,10],[8,4,8,10],[9,4,9,10],[8,1,8,3],[10,1,10,3],[14,1,14,3],[13,1,13,3],[30,7,30,14],[10,4,10,19],[16,4,16,9],[16,12,16,15],[19,4,19,9],[19,12,19,15],[18,4,18,9],[18,12,18,15],[17,4,17,9],[17,12,17,15],[23,14,23,20],[24,17,24,22],[43,10,43,14],[39,10,39,14],[24,4,24,6],[24,7,24,15],[25,7,25,15],[26,7,26,15],[37,8,37,9],[34,10,34,14]]}
[]
[]
[]
[]
[]
[null,null,null,null,{"$f":"IF('DANE PLACÓWKI'!F10<>0,'DANE PLACÓWKI'!F8,\"\")","v":""}]
[null,null,null,null,{"$f":"IF('DANE PLACÓWKI'!F10<>0,'DANE PLACÓWKI'!F10,'DANE PLACÓWKI'!F8)","v":0}]
[null,null,null,null,{"$f":"CONCATENATE('DANE PLACÓWKI'!F12,\" \",'DANE PLACÓWKI'!F14,\", \",'DANE PLACÓWKI'!F16, 'DANE PLACÓWKI'!G16,\" \", 'DANE PLACÓWKI'!F18)","v":" , ul.  "}]
[null,"Rodzaj zakupu",null,null,{"$f":"IF('DANE PLACÓWKI'!F20=\"\",\"\",CONCATENATE(\"TEL. \",'DANE PLACÓWKI'!F20))","v":""}]
[]
[null,null,null,null,{"$f":"VLOOKUP(B11,'PRZYKŁADOWE OPISY'!B2:C413,2,0)","v":{"$error":"#N/A"}}]
[]
[null,null,null,null,{"$f":"VLOOKUP(B13,'PRZYKŁADOWE OPISY'!B2:C415,2,0)","v":{"$error":"#N/A"}}]
[]
[null,null,null,null,{"$f":"VLOOKUP(B15,'PRZYKŁADOWE OPISY'!B2:C417,2,0)","v":{"$error":"#N/A"}}]
[]
[null,null,null,null,"Kwota wydatkowana z decyzji nr ",null,null,null,null,null,null,"dla ucznia",{"$f":"VLOOKUP(K17,'LISTA UCZNIÓW'!B:C,2,0)","v":{"$error":"#N/A"}},null,null,null,"wynosi"]
[null,null,null,null,"Kwota wydatkowana z decyzji nr ",null,null,null,null,null,null,"dla ucznia",{"$f":"VLOOKUP(K18,'LISTA UCZNIÓW'!B:C,2,0)","v":{"$error":"#N/A"}},null,null,null,"wynosi"]
[null,null,null,null,"Kwota wydatkowana z decyzji nr ",null,null,null,null,null,null,"dla ucznia",{"$f":"VLOOKUP(K19,'LISTA UCZNIÓW'!B:C,2,0)","v":{"$error":"#N/A"}},null,null,null,"wynosi"]
[null,null,null,null,"Kwota wydatkowana z decyzji nr ",null,null,null,null,null,null,"dla ucznia",{"$f":"VLOOKUP(K20,'LISTA UCZNIÓW'!B:C,2,0)","v":{"$error":"#N/A"}},null,null,null,"wynosi"]
{"$rows_left_out":38}
{"sheet":"Arkusz1","index":4,"n_rows":29,"n_cols":10,"rows_kept":29,"cut":false,"hidden":true,"merged":[[1,6,1,7],[16,6,16,7]]}
[null,null,"Słownie ","Budżet"]
[{"$f":"ABS(A14)","v":0},null,null,null,null,null,"jeżeli \"naście\""]
[null,null,"0-5","6-9","0-5","6-9","0-5","6-9","dodatek","sumuj te ciągi"]
[{"$f":"INT(A$2/10000000)","v":0},null,{"$f":"IF(AND(A4>=0,A4<=5),1,0)","v":1},{"$f":"IF(AND(A4>=6,A4<=9),1,0)","v":0},{"$f":"IF(A4=0,\"\",IF(A4=1,IF(A5=0,\"dziesięć milionów \",\"\"),IF(A4=2,\"dwadzieścia \",IF(A4=3,\"trzydzieści \",IF(A4=4,\"czterdzieści \",IF(A4=5,\"pięćdziesiąt \",\"\"))))))","v":""},{"$f":"IF(A4=6,\"sześćdziesiąt \",IF(A4=7,\"siedemdziesiąt \",IF(A4=8,\"osiemdziesiąt \",IF(A4=9,\"dziewięćdziesiąt \",\"\"))))","v":""},null,null,null,{"$f":"IF(C4,E4&I4,IF(D4,F4&I4,\"\"))","v":""}]
[{"$f":"INT(A$2/1000000)-A4*10","v":0},null,1,0,{"$f":"IF(A5=0,IF(AND(A4<>0,A4<>1),\"milionów \",\"\"),IF(A5=1,IF(A4=0,\"jeden milion \",\"jeden milionów \"),IF(A5=2,\"dwa miliony \",IF(A5=3,\"trzy miliony \",IF(A5=4,\"cztery miliony \",IF(A5=5,\"pięć milionów \",\"\"))))))","v":""},{"$f":"IF(A5=6,\"sześć milionów \",IF(A5=7,\"siedem milionów \",IF(A5=8,\"osiem milionów \",IF(A5=9,\"dziewięć milionów \",\"\"))))","v":""},{"$f":"IF(A5=0,\"\",IF(A5=1,\"jedenaście milionów \",IF(A5=2,\"dwanaście milionów \",IF(A5=3,\"trzynaście milionów \",IF(A5=4,\"czternaście milionów \",IF(A5=5,\"piętnaście milionów \",\"\"))))))","v":""},{"$f":"IF(A5=6,\"szesnaście milionów \",IF(A5=7,\"siedemnaście milionów \",IF(A5=8,\"osiemnaście milionów \",IF(A5=9,\"dziewiętnaście milionów \",\"\"))))","v":""},null,{"$f":"IF(A4=1,IF(C5,G5,IF(D5,H5)),IF(C5,E5,IF(D5,F5,\"\")))","v":""}]
[{"$f":"INT(A$2/100000)-10*A5-100*A4","v":0},null,1,0,{"$f":"IF(A6=0,\"\",IF(A6=1,\"sto \",IF(A6=2,\"dwieście \",IF(A6=3,\"trzysta \",IF(A6=4,\"czterysta \",IF(A6=5,\"pięćset \",\"\"))))))","v":""},{"$f":"IF(A6=6,\"sześćset \",IF(A6=7,\"siedemset \",IF(A6=8,\"osiemset \",IF(A6=9,\"dziewięćset \",\"\"))))","v":""},null,null,null,{"$f":"IF(C6,E6&I6,IF(D6,F6&I6,\"\"))","v":""}]
[{"$f":"INT(A$2/10000)-10*A6-100*A5-1000*A4","v":0},null,1,0,{"$f":"IF(A7=0,\"\",IF(A7=1,IF(A8=0,\"dziesięć tysięcy \",\"\"),IF(A7=2,\"dwadzieścia \",IF(A7=3,\"trzydzieści \",IF(A7=4,\"czterdzieści \",IF(A7=5,\"pięćdziesiąt \",\"\"))))))","v":""},{"$f":"IF(A7=6,\"sześćdziesiąt \",IF(A7=7,\"siedemdziesiąt \",IF(A7=8,\"osiemdziesiąt \",IF(A7=9,\"dziewięćdziesiąt \",\"\"))))","v":""},null,null,null,{"$f":"IF(C7,E7&I7,IF(D7,F7&I7,\"\"))","v":""}]
[{"$f":"INT(A$2/1000)-10*A7-100*A6-1000*A5-10000*A4","v":0},null,1,0,{"$f":"IF(A8=0,IF(OR(AND(A7<>0,A7<>1),AND(A6<>0,A7=0)),\"tysięcy \",\"\"),IF(A8=1,IF(AND(A6=0,A7=0),\"jeden tysiąc \",\"jeden tysięcy \"),IF(A8=2,\"dwa tysiące \",IF(A8=3,\"trzy tysiące \",IF(A8=4,\"cztery tysiące \",IF(A8=5,\"pięć tysięcy \",\"\"))))))","v":""},{"$f":"IF(A8=6,\"sześć tysięcy \",IF(A8=7,\"siedem tysięcy \",IF(A8=8,\"osiem tysięcy \",IF(A8=9,\"dziewięć tysięcy \",\"\"))))","v":""},{"$f":"IF(A8=0,\"\",IF(A8=1,\"jedenaście tysięcy \",IF(A8=2,\"dwanaście tysięcy \",IF(A8=3,\"trzynaście tysięcy \",IF(A8=4,\"czternaście tysięcy \",IF(A8=5,\"piętnaście tysięcy \",\"\"))))))","v":""},{"$f":"IF(A8=6,\"szesnaście tysięcy \",IF(A8=7,\"siedemnaście tysięcy \",IF(A8=8,\"osiemnaście tysięcy \",IF(A8=9,\"dziewiętnaście tysięcy \",\"\"))))","v":""},null,{"$f":"IF(A7=1,IF(C8,G8,IF(D8,H8)),IF(C8,E8,IF(D8,F8,\"\")))","v":""}]
[{"$f":"INT(A$2/100)-10*A8-100*A7-1000*A6-10000*A5-100000*A4","v":0},null,1,0,{"$f":"IF(A9=0,\"\",IF(A9=1,\"sto \",IF(A9=2,\"dwieście \",IF(A9=3,\"trzysta \",IF(A9=4,\"czterysta \",IF(A9=5,\"pięćset \",\"\"))))))","v":""},{"$f":"IF(A9=6,\"sześćset \",IF(A9=7,\"siedemset \",IF(A9=8,\"osiemset \",IF(A9=9,\"dziewięćset \",\"\"))))","v":""},null,null,null,{"$f":"IF(C9,E9&I9,IF(D9,F9&I9,\"\"))","v":""}]
[{"$f":"INT(A$2/10)-10*A9-100*A8-1000*A7-10000*A6-100000*A5-1000000*A4","v":0},null,1,0,{"$f":"IF(A10=0,\"\",IF(A10=1,IF(A11=0,\"dziesięć \",\"\"),IF(A10=2,\"dwadzieścia \",IF(A10=3,\"trzydzieści \",IF(A10=4,\"czterdzieści \",IF(A10=5,\"pięćdziesiąt \",\"\"))))))","v":""},{"$f":"IF(A10=6,\"sześćdziesiąt \",IF(A10=7,\"siedemdziesiąt \",IF(A10=8,\"osiemdziesiąt \",IF(A10=9,\"dziewięćdziesiąt \",\"\"))))","v":""},null,null,null,{"$f":"IF(C10,E10&I10,IF(D10,F10&I10,\"\"))","v":""}]
[{"$f":"INT(A$2)-10*A10-100*A9-1000*A8-10000*A7-100000*A6-1000000*A5-10000000*A4","v":0},null,1,0,{"$f":"IF(A11=0,\"\",IF(A11=1,\"jeden \",IF(A11=2,\"dwa \",IF(A11=3,\"trzy \",IF(A11=4,\"cztery \",IF(A11=5,\"pięć \",\"\"))))))","v":""},{"$f":"IF(A11=6,\"sześć \",IF(A11=7,\"siedem \",IF(A11=8,\"osiem \",IF(A11=9,\"dziewięć \",\"\"))))","v":""},{"$f":"IF(A11=0,\"\",IF(A11=1,\"jedenaście \",IF(A11=2,\"dwanaście \",IF(A11=3,\"trzynaście \",IF(A11=4,\"czternaście \",IF(A11=5,\"piętnaście \",\"\"))))))","v":""},{"$f":"IF(A11=6,\"szesnaście \",IF(A11=7,\"siedemnaście \",IF(A11=8,\"osiemnaście \",IF(A11=9,\"dziewiętnaście \",\"\"))))","v":""},null,{"$f":"IF(A10=1,IF(C11,G11,IF(D11,H11)),IF(C11,E11,IF(D11,F11,\"\")))","v":""}]
[{"$f":"ROUND((A2-TRUNC(A2,0))*100,0)","v":0},null,null,null,null,null,null,null,null,{"$f":"A12&\"/100 ZŁ\"","v":"0/100 ZŁ"}]
[null,null,null,null,"Słownie:"]
[{"$f":"'PIECZĄTKA STYPENDIA'!H25","v":0},null,null,null,{"$f":"J4&J5&J6&J7&J8&J9&J10&J11&J12","v":"0/100 ZŁ"}]
[]
[null,null,"Słownie","Jednorazowa"]
[{"$f":"ABS(A29)","v":0},null,null,null,null,null,"jeżeli \"naście\""]
[null,null,"0-5","6-9","0-5","6-9","0-5","6-9","dodatek","sumuj te ciągi"]
[{"$f":"INT(A$17/10000000)","v":0},null,{"$f":"IF(AND(A19>=0,A19<=5),1,0)","v":1},{"$f":"IF(AND(A19>=6,A19<=9),1,0)","v":0},{"$f":"IF(A19=0,\"\",IF(A19=1,IF(A20=0,\"dziesięć milionów \",\"\"),IF(A19=2,\"dwadzieścia \",IF(A19=3,\"trzydzieści \",IF(A19=4,\"czterdzieści \",IF(A19=5,\"pięćdziesiąt \",\"\"))))))","v":""},{"$f":"IF(A19=6,\"sześćdziesiąt \",IF(A19=7,\"siedemdziesiąt \",IF(A19=8,\"osiemdziesiąt \",IF(A19=9,\"dziewięćdziesiąt \",\"\"))))","v":""},null,null,null,{"$f":"IF(C19,E19&I19,IF(D19,F19&I19,\"\"))","v":""}]
[{"$f":"INT(A$17/1000000)-A19*10","v":0},null,1,0,{"$f":"IF(A20=0,IF(AND(A19<>0,A19<>1),\"milionów \",\"\"),IF(A20=1,IF(A19=0,\"jeden milion \",\"jeden milionów \"),IF(A20=2,\"dwa miliony \",IF(A20=3,\"trzy miliony \",IF(A20=4,\"cztery miliony \",IF(A20=5,\"pięć milionów \",\"\"))))))","v":""},{"$f":"IF(A20=6,\"sześć milionów \",IF(A20=7,\"siedem milionów \",IF(A20=8,\"osiem milionów \",IF(A20=9,\"dziewięć milionów \",\"\"))))","v":""},{"$f":"IF(A20=0,\"\",IF(A20=1,\"jedenaście milionów \",IF(A20=2,\"dwanaście milionów \",IF(A20=3,\"trzynaście milionów \",IF(A20=4,\"czternaście milionów \",IF(A20=5,\"piętnaście milionów \",\"\"))))))","v":""},{"$f":"IF(A20=6,\"szesnaście milionów \",IF(A20=7,\"siedemnaście milionów \",IF(A20=8,\"osiemnaście milionów \",IF(A20=9,\"dziewiętnaście milionów \",\"\"))))","v":""},null,{"$f":"IF(A19=1,IF(C20,G20,IF(D20,H20)),IF(C20,E20,IF(D20,F20,\"\")))","v":""}]
{"$rows_left_out":10}
{"sheet":"PIECZĄTKA WYPRAWKA","index":5,"n_rows":45,"n_cols":14,"rows_kept":45,"cut":false,"hidden":false,"merged":[[14,4,14,13],[17,1,17,13],[38,7,38,8],[1,8,5,14],[5,1,5,6],[1,1,1,7],[2,1,2,7],[3,1,3,7],[4,1,4,7],[6,1,7,4],[6,5,7,14],[11,11,11,13],[12,1,12,3],[12,4,12,13],[13,4,13,13],[8,5,8,8],[8,9,8,14],[9,14,9,17],[41,1,41,13],[25,1,25,3],[39,7,39,12],[35,7,35,12],[21,7,21,8],[22,7,22,12],[30,7,30,8],[31,7,31,12],[34,7,34,12],[28,1,29,8],[18,4,18,12],[19,4,19,12],[43,7,43,8],[44,7,44,12],[25,5,25,6],[26,7,26,8],[27,7,27,12],[36,1,37,8],[32,7,32,8],[33,7,33,8]]}
[]
[null,{"$f":"IF('DANE PLACÓWKI'!F10<>0,'DANE PLACÓWKI'!F8,\"\")","v":""}]
[null,{"$f":"IF('DANE PLACÓWKI'!F10<>0,'DANE PLACÓWKI'!F10,'DANE PLACÓWKI'!F8)","v":0}]
[null,{"$f":"CONCATENATE('DANE PLACÓWKI'!F12,\" \",'DANE PLACÓWKI'!F14,\", \",'DANE PLACÓWKI'!F16, 'DANE PLACÓWKI'!G16,\" \", 'DANE PLACÓWKI'!F18)","v":" , ul.  "}]
[null,{"$f":"IF('DANE PLACÓWKI'!F20=\"\",\"\",CONCATENATE(\"TEL. \",'DANE PLACÓWKI'!F20))","v":""}]
[]
[null,"Wydatek dotyczy",null,null,null,"wyłącznie działalności statutowej (brak możliwości odliczenia)."]
[]
[null,"Data wpływu faktury:"]
[]
[]
[null,null,null,null,null,null,null,null,null,null,null,"podpis upoważnionego pracownika jednostki"]
[null,"Wydatku na kwotę:",null,null,{"$f":"SUM(L16:L16)","v":0}]
[null,"słownie:      ",null,null,{"$f":"Arkusz1!E29","v":"0/100 ZŁ"}]
[null,"dokonano z:"]
[null,"dz.",{"$f":"IF(E16=\"\",\"\",(LEFT(E16,3)))","v":""},"rozdz.",null,"§ - ",null,"zadanie",null,"kwota",null,null,"środki","Budżet"]
[]
[null,"z zastosowaniem procedur zgodnie z regulaminem zakupów o równowartości do 30 tys. euro"]
[null,"oraz na podstawie:",null,null,"art.4 pkt 8"]
[null,null,null,null,"Ustawy Prawo Zamówień Publicznych"]
{"$rows_left_out":26}
{"sheet":"PRZYKŁADOWE OPISY","index":6,"n_rows":20,"n_cols":3,"rows_kept":20,"cut":false,"hidden":false,"merged":[]}
[null,"RODZAJ ZAKUPU","PRZYKŁADOWE OPISY"]
[null,"Książki/ podręczniki","Potwierdzam poniesienie wydatku na zakup książek/ podręczników w ramach przyznanego stypendium szkolnego 2019/2020."]
[null,"Artykuły szkolne","Potwierdzam poniesienie wydatku na zakup artykułów szkolnych w ramach przyznanego stypendium szkolnego 2019/2020."]
[null,"Plecak/ piórnik/ torba na książki","Potwierdzam poniesienie wydatku na zakup plecaka/ piórnika/ torby na książki w ramach przyznanego stypendium szkolnego 2019/2020."]
[null,"Strój sportowy/ obuwie sportowe - zajęcia dodatkowe","Potwierdzam poniesienie wydatku na zakup stroju sportowego/ obuwia sportowego w ramach przyznanego stypendium szkolnego 2019/2020. Strój sportowy/ obuwie sportowe wykorzystywany będzie na zajęciach dodatkowych zgodnie z zainteresowaniami ucznia."]
[null,"Strój gimnastyczny/ obuwie sportowe","Potwierdzam poniesienie wydatku na zakup stroju gimnastycznego/ obuwia w ramach przyznanego stypendium szkolnego 2019/2020. Strój gimnastyczny/ obuwie wykorzystywany będzie na zajęciach wychowania fizycznego w szkole."]
[null,"Strój galowy","Potwierdzam poniesienie wydatku na zakup stroju galowego w ramach przyznanego stypendium szkolnego 2019/2020, określonego regulaminem szkolnym."]
[null,"Zajęcia dodatkowe","Potwierdzam poniesienie wydatku na zakup zajęć dodatkowych w ramach przyznanego stypendium szkolnego 2019/2020. Wydatek dotyczy zajęć dodatkowych zgodnie z zainteresowaniami ucznia."]
[null,"Instrumenty muzyczne","Potwierdzam poniesienie wydatku na zakup instrumentu muzycznego w ramach przyznanego stypendium szkolnego 2019/2020. Instrument muzyczny służy uczniowi w zajęciach pozaszkolnych zgodnie z jego zainteresowaniami."]
[null,"Sprzęt sportowy","Potwierdzam poniesienie wydatku na zakup sprzętu sportowego w ramach przyznanego stypendium szkolnego 2019/2020. Sprzęt sportowy służy uczniowi w zajęciach pozaszkolnych, zgodnie z jego zainteresowaniami."]
[null,"Wycieczki, zielone szkoły","Potwierdzam poniesienie wydatku za udział w wycieczce szkolnej w ramach przyznanego stypendium szkolnego 2019/2020."]
[null,"Wycieczki, zielone szkoły – wspólna faktura z biura podróży","Potwierdzam poniesienie wydatku za udział w wycieczce szkolnej w ramach przyznanego stypendium szkolnego 2019/2020. Rodzic wpłacił należność za ucznia w formie gotówki nauczycielowi szkoły. "]
[null,"Dojazd do szkoły","Potwierdzam poniesienie wydatku na dojazd do szkoły - bilet 30/ 90 dniowy w ramach przyznanego stypendium szkolnego 2019/2020."]
[null,"Usługi internetowe","Potwierdzam poniesienie wydatku na zakup usługi internetowej w ramach przyznanego stypendium szkolnego 2019/2020."]
[null,"Usługi internetowe - wspólne gospodarstwo","Potwierdzam poniesienie wydatku na zakup usługi internetowej w ramach przyznanego stypendium szkolnego 2019/2020. Faktura wystawiona została na osobę trzecią, a wydatek ponosi rodzic stypendysty."]
[null,"Komputer/ laptop","Potwierdzam poniesienie wydatku na zakup komputera/ laptopa dla celów edukacyjnych w ramach przyznanego stypendium szkolnego 2019/2020."]
[null,"Programy edukacyjne","Potwierdzam dokonanie wydatku na zakup oprogramowania edukacyjnego/ narzędziowego dla celów edukacyjnych w ramach przyznanego stypendium szkolnego 2019/2020."]
[null,"Akcesoria komputerowe","Urządzenia peryferyjne do komputera zakupiono w ramach stypendium szkolnego dla celów edukacyjnych, w ramach przyznanego stypendium szkolnego 2019/2020."]
[null,"Artykuły szkolne - bez pozycji","Potwierdzam poniesienie wydatku na zakup artykułów szkolnych w ramach przyznanego stypendium szkolnego 2019/2020. Zatwierdzeniu do wypłaty nie podlegają następujące pozycje: ………………………………………………………………………..(należy wpisać ręcznie)."]
[null,"Artykuły szkolne - tylko część pozycji","Potwierdzam poniesienie wydatku na zakup artykułów szkolnych w ramach przyznanego stypendium szkolnego 2019/2020. Zatwierdzeniu do wypłaty podlegają tylko następujące pozycje: …………………………………………………………………………..(należy wpisać ręcznie)."]